ubuntuusers.de

Fehlermeldung bei osmocom kompilierung

Status: Ungelöst | Ubuntu-Version: Nicht spezifiziert
Antworten |

iphoneman

Anmeldungsdatum:
28. April 2011

Beiträge: 2

Hallo,

beim kompilieren/installiern von osmocombb habe ich folgende Fehlermeldung: e checking dependency style of gcc... gcc3 ../configure: line 3786: syntax error near unexpected token pic-only' ../configure: line 3786: LT_INIT(pic-only)' make: *** [shared/libosmocore/build-target/Makefile] Fehler 2

Ich habe folgende Anleitung gemacht: 4.OsmocomBB und die Firmware Kompilieren wie im wiki

$ git clone git://git.osmocom.org/osmocom-bb.git

$ cd osmocom-bb

$ git pull –rebase

$ cd src

$ make

nach make kommt diese Fehlermeldung!

Ich arbeite mit einer Ubuntu-version 12.04 LTS in einer VBox von oracel (64bit)

Wäre schön, wenn mir jemand helfen könnte, da im Netz kaum brauchbares zu finden ist.

VG

user_unknown

Avatar von user_unknown

Anmeldungsdatum:
10. August 2005

Beiträge: 17594

Wohnort: Berlin

iphoneman schrieb:

Als Code formatiert:

1
2
3
4
 checking dependency style of gcc... gcc3
 ../configure: line 3786: syntax error near unexpected token `pic-only'
 ../configure: line 3786: `LT_INIT(pic-only)'
 make: *** [shared/libosmocore/build-target/Makefile] Fehler 2

famont

Anmeldungsdatum:
24. Februar 2014

Beiträge: 1

Hallo ich bekomme die gleiche Fehlermeldung wenn ich den Befehl make tätige

cd ~/catchercatcher/osmocom-bb git checkout --track origin/luca/catcher cd src export PATH=$PATH:~/catchercatcher/gnuarm-3.4.3/bin make

checking dependency style of gcc... gcc3 ../configure: line 3786: syntax error near unexpected token pic-only' ../configure: line 3786: LT_INIT(pic-only)' make: *** [shared/libosmocore/build-target/Makefile] Fehler 2

Antworten |